Target
Melatonin receptor type 1B
Ligand
BDBM50352003
Substrate
Meas. Tech.
ChEMBL_766804 (CHEMBL1827744)
Ki
0.2±n/a nM
Citation
 El Kazzouli, SGriffon du Bellay, ABerteina-Raboin, SDelagrange, PCaignard, DHGuillaumet, G Design and synthesis of 2-phenylimidazo[1,2-a]pyridines as a novel class of melatonin receptor ligands. Eur J Med Chem 46:4252-7 (2011)  
Target
Name:
Melatonin receptor type 1B
Synonyms:
MTNR1B Mel-1B-R Melatonin 1B Melatonin receptor type 1B | Melatonin receptor type 2 (MT2)
Type:
Enzyme
Mol. Mass.:
40203.54
Organism:
Homo sapiens (Human)
Description:
P49286
Residue:
362
  
Inhibitor
Name:
BDBM50352003
Synonyms:
CHEMBL1823015
Type:
Small organic molecule
Emp. Form.:
C18H19N3O2
Mol. Mass.:
309.3624
SMILES:
COc1ccc2[nH]c(c(CCNC(C)=O)c2n1)-c1ccccc1
: