Target
Delta-type opioid receptor
Ligand
BDBM50352118
Substrate
Meas. Tech.
ChEMBL_767032 (CHEMBL1828463)
Ki
128±n/a nM
Citation
 Yuan, YElbegdorj, OChen, JAkubathini, SKBeletskaya, IOSelley, DEZhang, Y Structure selectivity relationship studies of 17-cyclopropylmethyl-3,14ß-dihydroxy-4,5a-epoxy-6ß-[(4'-pyridyl)carboxamido]morphinan derivatives toward the development of the mu opioid receptor antagonists. Bioorg Med Chem Lett 21:5625-9 (2011)  
Target
Name:
Delta-type opioid receptor
Synonyms:
D-OR-1 Delta opioid receptor OPIATE Delta OPRD1 OPRK1 | opioid receptor, delta 1
Type:
G Protein-Coupled Receptor (GPCR)
Mol. Mass.:
40382.98
Organism:
Homo sapiens (Human)
Description:
Competition binding assays were carried out using membrane preparations from transfected HN9.10 cells that constitutively expressed the delta opioid receptor.
Residue:
372
  
Inhibitor
Name:
BDBM50352118
Synonyms:
CHEMBL1824513 | CHEMBL1852602
Type:
Small organic molecule
Emp. Form.:
C26H28BrN3O4
Mol. Mass.:
526.422
SMILES:
Oc1ccc2C[C@H]3N(CC4CC4)CC[C@@]45[C@@H](Oc1c24)[C@@H](CC[C@@]35O)NC(=O)c1ccncc1Br
: