Target
Kappa-type opioid receptor
Ligand
BDBM50352118
Substrate
Meas. Tech.
ChEMBL_767031 (CHEMBL1828462)
Ki
2.8±n/a nM
Citation
 Yuan, YElbegdorj, OChen, JAkubathini, SKBeletskaya, IOSelley, DEZhang, Y Structure selectivity relationship studies of 17-cyclopropylmethyl-3,14ß-dihydroxy-4,5a-epoxy-6ß-[(4'-pyridyl)carboxamido]morphinan derivatives toward the development of the mu opioid receptor antagonists. Bioorg Med Chem Lett 21:5625-9 (2011)  
Target
Name:
Kappa-type opioid receptor
Synonyms:
K-OR-1 Kappa-opioid receptor (KOR) Kappa-type opioid receptor (KOR) OPIATE Kappa OPRK1 kappa opioid receptor (KOR)
Type:
G Protein-Coupled Receptor (GPCR)
Mol. Mass.:
42648.76
Organism:
Homo sapiens (Human)
Description:
P41145
Residue:
380
  
Inhibitor
Name:
BDBM50352118
Synonyms:
CHEMBL1824513 | CHEMBL1852602
Type:
Small organic molecule
Emp. Form.:
C26H28BrN3O4
Mol. Mass.:
526.422
SMILES:
Oc1ccc2C[C@H]3N(CC4CC4)CC[C@@]45[C@@H](Oc1c24)[C@@H](CC[C@@]35O)NC(=O)c1ccncc1Br
: