Target
Aurora kinase C
Ligand
BDBM50352313
Substrate
Meas. Tech.
ChEMBL_766654 (CHEMBL1827220)
Kd
17±n/a nM
Citation
 Abraham, SHadd, MJTran, LVickers, TSindac, JMilanov, ZVHolladay, MWBhagwat, SSHua, HFord Pulido, JMCramer, MDGitnick, DJames, JDao, ABelli, BArmstrong, RCTreiber, DKLiu, G Novel series of pyrrolotriazine analogs as highly potent pan-Aurora kinase inhibitors. Bioorg Med Chem Lett 21:5296-300 (2011)  
Target
Name:
Aurora kinase C
Synonyms:
AIE2 AIRK3 AURKC Aurora Kinase C (Aurora-C) Aurora kinase C (AURKC) Aurora-C/INCENP Aurora/Ipl1/Eg2 protein 2 Serine/threonine-protein kinase 13 | Serine/threonine-protein kinase Aurora-C
Type:
Enzyme
Mol. Mass.:
35602.43
Organism:
Homo sapiens (Human)
Description:
Amino acid residues 1-309 were expressed as His-tagged fusion protein using baculovirus expression system.
Residue:
309
  
Inhibitor
Name:
BDBM50352313
Synonyms:
CHEMBL1822493
Type:
Small organic molecule
Emp. Form.:
C22H24N8O2S
Mol. Mass.:
464.543
SMILES:
Cc1cc(Nc2nc(Sc3ccc(NC(=O)CN4CCOCC4)cc3)nn3cccc23)n[nH]1
: