Target
Histamine H3 receptor
Ligand
BDBM50352081
Substrate
Meas. Tech.
ChEMBL_766669 (CHEMBL1827363)
Ki
0.2±n/a nM
Citation
 Levoin, NLabeeuw, OCalmels, TPoupardin-Olivier, OBerrebi-Bertrand, ILecomte, JMSchwartz, JCCapet, M Novel and highly potent histamine H3 receptor ligands. Part 1: withdrawing of hERG activity. Bioorg Med Chem Lett 21:5378-83 (2011)  
Target
Name:
Histamine H3 receptor
Synonyms:
G-protein coupled receptor 97 HH3R HRH3 Histamine H3 receptor (H3) Histamine receptor (H3 and H4)
Type:
G Protein-Coupled Receptor (GPCR)
Mol. Mass.:
48691.47
Organism:
Homo sapiens (Human)
Description:
Binding assays were using CHO cells stably expressing hH3R receptors.
Residue:
445
  
Inhibitor
Name:
BDBM50352081
Synonyms:
CHEMBL1824230
Type:
Small organic molecule
Emp. Form.:
C22H36N2O
Mol. Mass.:
344.534
SMILES:
CN(C)[C@H]1CC[C@H](CC1)c1ccc(OCCCN2CCCCC2)cc1
: