Target
Histamine H3 receptor
Ligand
BDBM50246290
Substrate
Meas. Tech.
ChEMBL_766669 (CHEMBL1827363)
Ki
0.06875±n/a nM
Citation
 Levoin, NLabeeuw, OCalmels, TPoupardin-Olivier, OBerrebi-Bertrand, ILecomte, JMSchwartz, JCCapet, M Novel and highly potent histamine H3 receptor ligands. Part 1: withdrawing of hERG activity. Bioorg Med Chem Lett 21:5378-83 (2011)  
Target
Name:
Histamine H3 receptor
Synonyms:
G-protein coupled receptor 97 HH3R HRH3 Histamine H3 receptor (H3) Histamine receptor (H3 and H4)
Type:
G Protein-Coupled Receptor (GPCR)
Mol. Mass.:
48691.47
Organism:
Homo sapiens (Human)
Description:
Binding assays were using CHO cells stably expressing hH3R receptors.
Residue:
445
  
Inhibitor
Name:
BDBM50246290
Synonyms:
2-(4-(1-cyclobutylpiperidin-4-yloxy)phenyl)-3-methylquinazolin-4(3H)-one | CHEMBL488249
Type:
Small organic molecule
Emp. Form.:
C24H27N3O2
Mol. Mass.:
389.4901
SMILES:
Cn1c(nc2ccccc2c1=O)-c1ccc(OC2CCN(CC2)C2CCC2)cc1
: