Target
Potassium voltage-gated channel subfamily H member 2
Ligand
BDBM50352707
Substrate
Meas. Tech.
ChEMBL_766845 (CHEMBL1827878)
IC50
1300±n/a nM
Citation
 Seo, HJPark, EJKim, MJKang, SYLee, SHKim, HJLee, KNJung, MELee, MKim, MSSon, EJPark, WKKim, JLee, J Design and synthesis of novel arylpiperazine derivatives containing the imidazole core targeting 5-HT(2A) receptor and 5-HT transporter. J Med Chem 54:6305-18 (2011)  
Target
Name:
Potassium voltage-gated channel subfamily H member 2
Synonyms:
1,3-beta-glucan synthase component GLS2 ERG Eag-related protein 1 Ether-a-go-go-related gene (HERG) Ether-a-go-go-related gene potassium channel 1 Ether-a-go-go-related gene potassium channel 1 (hERG1) Ether-a-go-go-related protein 1 H-ERG KCNH2 Potassium voltage-gated channel subfamily H member 2 (hERG) Voltage-gated potassium channel subunit Kv11.1 hERG Potassium Channel 1 | putative potassium channel subunit
Type:
Multi-pass membrane protein
Mol. Mass.:
126672.65
Organism:
Homo sapiens (Human)
Description:
Q12809
Residue:
1159
  
Inhibitor
Name:
BDBM50352707
Synonyms:
CHEMBL1823065
Type:
Small organic molecule
Emp. Form.:
C31H34ClN5O
Mol. Mass.:
528.088
SMILES:
Cc1c(nc(-c2ccccc2)n1-c1ccccc1)C(=O)NCCCN1CCN(CC1)c1cccc(Cl)c1C
: