Target
Sodium-dependent serotonin transporter
Ligand
BDBM50352709
Substrate
Meas. Tech.
ChEMBL_766795 (CHEMBL1827735)
IC50
1276±n/a nM
Citation
 Seo, HJPark, EJKim, MJKang, SYLee, SHKim, HJLee, KNJung, MELee, MKim, MSSon, EJPark, WKKim, JLee, J Design and synthesis of novel arylpiperazine derivatives containing the imidazole core targeting 5-HT(2A) receptor and 5-HT transporter. J Med Chem 54:6305-18 (2011)  
Target
Name:
Sodium-dependent serotonin transporter
Synonyms:
5-HT Transporter 5HTT SC6A4_HUMAN SLC6A4 Serotonin transporter (5HTT) Sodium-dependent serotonin transporter (SERT) | Solute carrier family 6 member 4
Type:
Multi-pass membrane protein
Mol. Mass.:
70322.51
Organism:
Homo sapiens (Human)
Description:
P31645
Residue:
630
  
Inhibitor
Name:
BDBM50352709
Synonyms:
CHEMBL1823206
Type:
Small organic molecule
Emp. Form.:
C26H30Cl3N5O2
Mol. Mass.:
550.908
SMILES:
CCCc1nc(cn1-c1ccc(Cl)cc1)C(=O)NCC(O)CN1CCN(CC1)c1cccc(Cl)c1Cl
: