Target
5-hydroxytryptamine receptor 2C
Ligand
BDBM9274
Substrate
Meas. Tech.
ChEMBL_766794 (CHEMBL1827734)
IC50
66±n/a nM
Citation
 Seo, HJPark, EJKim, MJKang, SYLee, SHKim, HJLee, KNJung, MELee, MKim, MSSon, EJPark, WKKim, JLee, J Design and synthesis of novel arylpiperazine derivatives containing the imidazole core targeting 5-HT(2A) receptor and 5-HT transporter. J Med Chem 54:6305-18 (2011)  
Target
Name:
5-hydroxytryptamine receptor 2C
Synonyms:
5-HT-2C 5-HT2C-INI 5-HTR2C 5-hydroxytryptamine receptor 2C (5-HT-2C) 5HT-1C HTR1C Serotonin (5-HT3) receptor Serotonin Receptor 2C
Type:
G Protein-Coupled Receptor (GPCR)
Mol. Mass.:
51836.79
Organism:
Homo sapiens (Human)
Description:
P28335
Residue:
458
  
Inhibitor
Name:
BDBM9274
Synonyms:
CHEMBL1822893 | US8835436, Example 8
Type:
Emp. Form.:
C24H27Cl2N5O
Mol. Mass.:
472.41
SMILES:
Cc1nc(C(=O)NCCN2CCN(CC2)c2cccc(Cl)c2Cl)c(C)n1-c1ccccc1
: