Target
5-hydroxytryptamine receptor 2A
Ligand
BDBM50352740
Substrate
Meas. Tech.
ChEMBL_766793 (CHEMBL1827733)
IC50
39±n/a nM
Citation
 Seo, HJPark, EJKim, MJKang, SYLee, SHKim, HJLee, KNJung, MELee, MKim, MSSon, EJPark, WKKim, JLee, J Design and synthesis of novel arylpiperazine derivatives containing the imidazole core targeting 5-HT(2A) receptor and 5-HT transporter. J Med Chem 54:6305-18 (2011)  
Target
Name:
5-hydroxytryptamine receptor 2A
Synonyms:
5-HT-2 5-HT2A 5-hydroxytryptamine receptor 2A (5HT-2A) 5HT2A_HUMAN HTR2A | Serotonin receptor 2A
Type:
undefined
Mol. Mass.:
52607.65
Organism:
Homo sapiens (Human)
Description:
P28223
Residue:
471
  
Inhibitor
Name:
BDBM50352740
Synonyms:
CHEMBL1822895 | US8835436, Example 9
Type:
Small organic molecule
Emp. Form.:
C26H31Cl2N5O
Mol. Mass.:
500.463
SMILES:
CCCc1nc(C(=O)NCCN2CCN(CC2)c2cccc(Cl)c2Cl)c(C)n1-c1ccccc1
: