Target
5-hydroxytryptamine receptor 2C
Ligand
BDBM50352743
Substrate
Meas. Tech.
ChEMBL_766794 (CHEMBL1827734)
IC50
109±n/a nM
Citation
 Seo, HJPark, EJKim, MJKang, SYLee, SHKim, HJLee, KNJung, MELee, MKim, MSSon, EJPark, WKKim, JLee, J Design and synthesis of novel arylpiperazine derivatives containing the imidazole core targeting 5-HT(2A) receptor and 5-HT transporter. J Med Chem 54:6305-18 (2011)  
Target
Name:
5-hydroxytryptamine receptor 2C
Synonyms:
5-HT-1C 5-HT1C 5-HT2C-INI 5-HTR2C 5-hydroxytryptamine receptor 2C (5-HT-2C) 5HT-1C HTR1C Serotonin (5-HT3) receptor Serotonin Receptor 2C
Type:
G Protein-Coupled Receptor (GPCR)
Mol. Mass.:
51836.79
Organism:
Homo sapiens (Human)
Description:
P28335
Residue:
458
  
Inhibitor
Name:
BDBM50352743
Synonyms:
CHEMBL1822899
Type:
Small organic molecule
Emp. Form.:
C30H31Cl2N5O
Mol. Mass.:
548.506
SMILES:
Cc1c(nc(-c2ccccc2)n1-c1ccccc1)C(=O)NCCCN1CCN(CC1)c1cccc(Cl)c1Cl
: