Target
ALK tyrosine kinase receptor
Ligand
BDBM50344663
Substrate
Meas. Tech.
ChEMBL_766970 (CHEMBL1828297)
IC50
27±n/a nM
Citation
 Kinoshita, KKobayashi, TAsoh, KFuruichi, NIto, TKawada, HHara, SOhwada, JHattori, KMiyagi, THong, WSPark, MJTakanashi, KTsukaguchi, TSakamoto, HTsukuda, TOikawa, N 9-substituted 6,6-dimethyl-11-oxo-6,11-dihydro-5H-benzo[b]carbazoles as highly selective and potent anaplastic lymphoma kinase inhibitors. J Med Chem 54:6286-94 (2011)  
Target
Name:
ALK tyrosine kinase receptor
Synonyms:
ALK ALK_HUMAN CD_antigen: CD246
Type:
Protein
Mol. Mass.:
176453.10
Organism:
Homo sapiens (Human)
Description:
Q9UM73
Residue:
1620
  
Inhibitor
Name:
BDBM50344663
Synonyms:
6,6-dimethyl-8-(4-(oxetan-3-yl)piperazin-1-yl)-11-oxo-6,11-dihydro-5H-benzo[b]carbazole-3-carbonitrile | CHEMBL1779201
Type:
Small organic molecule
Emp. Form.:
C26H26N4O2
Mol. Mass.:
426.5102
SMILES:
CC1(C)c2[nH]c3cc(ccc3c2C(=O)c2ccc(cc12)N1CCN(CC1)C1COC1)C#N
: