Target
Beta-secretase 1
Ligand
BDBM50352867
Substrate
Meas. Tech.
ChEMBL_767496 (CHEMBL1825608)
EC50
200±n/a nM
Citation
 Malamas, MSErdei, JGunawan, IBarnes, KHui, YJohnson, MRobichaud, AZhou, PYan, YSolvibile, WTurner, JFan, KYChopra, RBard, JPangalos, MN New pyrazolyl and thienyl aminohydantoins as potent BACE1 inhibitors: exploring the S2' region. Bioorg Med Chem Lett 21:5164-70 (2011)  
Target
Name:
Beta-secretase 1
Synonyms:
ASP2 Aspartyl protease 2 BACE1 Beta-secretase (BACE) Beta-secretase 1 (BACE 1) Beta-secretase 1 (BACE1) Beta-site amyloid precursor protein cleaving enzyme 1 Memapsin-2 beta-Secretase (BACE-1) | beta-Secretase (BACE1)
Type:
Protein
Mol. Mass.:
55755.10
Organism:
Homo sapiens (Human)
Description:
P56817
Residue:
501
  
Inhibitor
Name:
BDBM50352867
Synonyms:
CHEMBL1824357
Type:
Small organic molecule
Emp. Form.:
C19H14F2N4OS
Mol. Mass.:
384.402
SMILES:
CN1C(N)=NC(C1=O)(c1ccsc1)c1ccc(F)c(c1)-c1cccnc1F
: