Target
Renin
Ligand
BDBM50352958
Substrate
Meas. Tech.
ChEMBL_767700 (CHEMBL1825812)
IC50
55±n/a nM
Citation
 Scheiper, BMatter, HSteinhagen, HBöcskei, ZFleury, VMcCort, G Structure-based optimization of potent 4- and 6-azaindole-3-carboxamides as renin inhibitors. Bioorg Med Chem Lett 21:5480-6 (2011)  
Target
Name:
Renin
Synonyms:
Angiotensinogenase RENI_HUMAN
Type:
Enzyme
Mol. Mass.:
45058.99
Organism:
Homo sapiens (Human)
Description:
Residue:
406
  
Inhibitor
Name:
BDBM50352958
Synonyms:
CHEMBL1824932
Type:
Small organic molecule
Emp. Form.:
C24H20ClFN4O2
Mol. Mass.:
450.893
SMILES:
Fc1ccc(Cl)c(Oc2c(C(=O)N3CCNCC3)c3ncccc3n2-c2ccccc2)c1
: