Target
Renin
Ligand
BDBM50353003
Substrate
Meas. Tech.
ChEMBL_767702 (CHEMBL1825814)
IC50
26±n/a nM
Citation
 Scheiper, BMatter, HSteinhagen, HBöcskei, ZFleury, VMcCort, G Structure-based optimization of potent 4- and 6-azaindole-3-carboxamides as renin inhibitors. Bioorg Med Chem Lett 21:5480-6 (2011)  
Target
Name:
Renin
Synonyms:
Angiotensinogenase RENI_HUMAN
Type:
Enzyme
Mol. Mass.:
45058.99
Organism:
Homo sapiens (Human)
Description:
Residue:
406
  
Inhibitor
Name:
BDBM50353003
Synonyms:
CHEMBL1825183
Type:
Small organic molecule
Emp. Form.:
C26H25FN4O
Mol. Mass.:
428.5013
SMILES:
Cc1c(F)cccc1Cc1c(C(=O)N2CCNCC2)c2ccncc2n1-c1ccccc1
: