Target
Branched-chain-amino-acid aminotransferase, cytosolic
Ligand
BDBM50353006
Substrate
Meas. Tech.
ChEMBL_767755 (CHEMBL1825867)
IC50
15000±n/a nM
Citation
 Mendoza, RPetros, AMLiu, YThimmapaya, RSurowy, CSLeise, WFPereda-Lopez, APanchal, SCSun, C Cracking the molecular weight barrier: fragment screening of an aminotransferase using an NMR-based functional assay. Bioorg Med Chem Lett 21:5248-50 (2011)  
Target
Name:
Branched-chain-amino-acid aminotransferase, cytosolic
Synonyms:
BCAT1 BCT1 ECA39
Type:
PROTEIN
Mol. Mass.:
42957.10
Organism:
Homo sapiens (Human)
Description:
ChEMBL_1516919
Residue:
386
  
Inhibitor
Name:
BDBM50353006
Synonyms:
CHEMBL1825195
Type:
Small organic molecule
Emp. Form.:
C10H4F2N2O
Mol. Mass.:
206.1484
SMILES:
Fc1cccc(-c2oncc2C#N)c1F
: