Target
Androgen receptor
Ligand
BDBM50353036
Substrate
Meas. Tech.
ChEMBL_766307 (CHEMBL1826239)
IC50
18640±n/a nM
Citation
 Axerio-Cilies, PLack, NANayana, MRChan, KHYeung, ALeblanc, EGuns, ESRennie, PSCherkasov, A Inhibitors of androgen receptor activation function-2 (AF2) site identified through virtual screening. J Med Chem 54:6197-205 (2011)  
Target
Name:
Androgen receptor
Synonyms:
ANDR_HUMAN Androgen Receptor Androgen receptor/Baculoviral IAP repeat-containing protein 2 Dihydrotestosterone receptor Nuclear receptor subfamily 3 group C member 4
Type:
Receptor
Mol. Mass.:
99185.27
Organism:
Homo sapiens (Human)
Description:
CHO cells were stably transfected with human AR gene.
Residue:
920
  
Inhibitor
Name:
BDBM50353036
Synonyms:
CHEMBL1822156
Type:
Small organic molecule
Emp. Form.:
C17H14N2O2
Mol. Mass.:
278.3053
SMILES:
Oc1ccc(cc1O)C1Nc2cccc3cccc(N1)c23
: