Target
Insulin receptor
Ligand
BDBM50353055
Substrate
Meas. Tech.
ChEMBL_767866 (CHEMBL1825978)
IC50
1874±n/a nM
Citation
 Ott, GRWells, GJThieu, TVQuail, MRLisko, JGMesaros, EFGingrich, DEGhose, AKWan, WLu, LCheng, MAlbom, MSAngeles, TSHuang, ZAimone, LDAtor, MARuggeri, BADorsey, BD 2,7-disubstituted-pyrrolo[2,1-f][1,2,4]triazines: new variant of an old template and application to the discovery of anaplastic lymphoma kinase (ALK) inhibitors with in vivo antitumor activity. J Med Chem 54:6328-41 (2011)  
Target
Name:
Insulin receptor
Synonyms:
INSR INSR_HUMAN Insulin receptor beta subunit
Type:
Receptor Tyrosine Kinase
Mol. Mass.:
156322.60
Organism:
Homo sapiens (Human)
Description:
P06213
Residue:
1382
  
Inhibitor
Name:
BDBM50353055
Synonyms:
CHEMBL1822518
Type:
Small organic molecule
Emp. Form.:
C24H27N7O2S
Mol. Mass.:
477.582
SMILES:
CN1CCN(CC1)c1ccc(Nc2ncc3ccc(-c4ccccc4NS(C)(=O)=O)n3n2)cc1
: