Target
Cytochrome P450 1A2
Ligand
BDBM50353046
Substrate
Meas. Tech.
ChEMBL_767871 (CHEMBL1825983)
IC50
>12000±n/a nM
Citation
 Ott, GRWells, GJThieu, TVQuail, MRLisko, JGMesaros, EFGingrich, DEGhose, AKWan, WLu, LCheng, MAlbom, MSAngeles, TSHuang, ZAimone, LDAtor, MARuggeri, BADorsey, BD 2,7-disubstituted-pyrrolo[2,1-f][1,2,4]triazines: new variant of an old template and application to the discovery of anaplastic lymphoma kinase (ALK) inhibitors with in vivo antitumor activity. J Med Chem 54:6328-41 (2011)  
Target
Name:
Cytochrome P450 1A2
Synonyms:
CP1A2_HUMAN CYPIA2 Cytochrome P(3)450 Cytochrome P450 1A2 (CYP1A2) Cytochrome P450-P3
Type:
Enzyme
Mol. Mass.:
58423.38
Organism:
Homo sapiens (Human)
Description:
P05177
Residue:
516
  
Inhibitor
Name:
BDBM50353046
Synonyms:
CHEMBL1822525
Type:
Small organic molecule
Emp. Form.:
C28H35N7O4S
Mol. Mass.:
565.687
SMILES:
COc1cc(ccc1Nc1ncc2ccc(-c3ccccc3N(C)S(C)(=O)=O)n2n1)N1CCN(C[C@H](C)O)CC1
: