Target
ALK tyrosine kinase receptor
Ligand
BDBM50353039
Substrate
Meas. Tech.
ChEMBL_767865 (CHEMBL1825977)
IC50
7±n/a nM
Citation
 Ott, GRWells, GJThieu, TVQuail, MRLisko, JGMesaros, EFGingrich, DEGhose, AKWan, WLu, LCheng, MAlbom, MSAngeles, TSHuang, ZAimone, LDAtor, MARuggeri, BADorsey, BD 2,7-disubstituted-pyrrolo[2,1-f][1,2,4]triazines: new variant of an old template and application to the discovery of anaplastic lymphoma kinase (ALK) inhibitors with in vivo antitumor activity. J Med Chem 54:6328-41 (2011)  
Target
Name:
ALK tyrosine kinase receptor
Synonyms:
ALK ALK_HUMAN CD_antigen: CD246
Type:
Protein
Mol. Mass.:
176453.10
Organism:
Homo sapiens (Human)
Description:
Q9UM73
Residue:
1620
  
Inhibitor
Name:
BDBM50353039
Synonyms:
CHEMBL1821735
Type:
Small organic molecule
Emp. Form.:
C25H29N7O2S
Mol. Mass.:
491.608
SMILES:
CN(c1ccccc1-c1ccc2cnc(Nc3ccc(cc3)N3CCN(C)CC3)nn12)S(C)(=O)=O
: