Target
Cannabinoid receptor 1
Ligand
BDBM50353080
Substrate
Meas. Tech.
ChEMBL_767976 (CHEMBL1825305)
Ki
>10000±n/a nM
Citation
 Turkman, NShavrin, AIvanov, RARabinovich, BVolgin, AGelovani, JGAlauddin, MM Fluorinated cannabinoid CB2 receptor ligands: synthesis and in vitro binding characteristics of 2-oxoquinoline derivatives. Bioorg Med Chem 19:5698-707 (2011)  
Target
Name:
Cannabinoid receptor 1
Synonyms:
CANN6 CB-R CNR CNR1_HUMAN Cannabinoid receptor Cannabinoid receptor 1 (brain)
Type:
G Protein-Coupled Receptor (GPCR)
Mol. Mass.:
52868.96
Organism:
Homo sapiens (Human)
Description:
P21554
Residue:
472
  
Inhibitor
Name:
BDBM50353080
Synonyms:
CHEMBL1822934
Type:
Small organic molecule
Emp. Form.:
C14H15FN2O4
Mol. Mass.:
294.2783
SMILES:
COc1ccc2cc(C(=O)NCCF)c(=O)[nH]c2c1OC
: