Target
Sodium/hydrogen exchanger 1
Ligand
BDBM50353116
Substrate
Meas. Tech.
ChEMBL_768436 (CHEMBL1832155)
IC50
0.53±n/a nM
Citation
 Jin, LJiang, XMDu, PXu, JGong, GQWang, QJXu, YG Synthesis and Na+/H+ exchanger inhibitory activity of benzoylguanidine derivatives. Eur J Med Chem 46:4107-16 (2011)  
Target
Name:
Sodium/hydrogen exchanger 1
Synonyms:
NHE-1 Nhe1 Slc9a1 | Solute carrier family 9 member 1
Type:
PROTEIN
Mol. Mass.:
91655.00
Organism:
Rattus norvegicus
Description:
ChEMBL_862370
Residue:
820
  
Inhibitor
Name:
BDBM50353116
Synonyms:
CHEMBL1829128
Type:
Small organic molecule
Emp. Form.:
C29H36N6O6S
Mol. Mass.:
596.698
SMILES:
COc1ccc(CN2CCN(CCOc3ccc(cc3NC(=O)c3ccsc3)C(=O)NC(N)=N)CC2)c(OC)c1OC
: