Target
Transforming growth factor beta-1 proprotein
Ligand
BDBM50184872
Substrate
Meas. Tech.
ChEMBL_768740 (CHEMBL1831613)
IC50
446±n/a nM
Citation
 Ciayadi, RPotdar, MWalton, KLHarrison, CAKelso, GFHarris, SJHearn, MT 2-Phenyl and 2-heterocyclic-4-(3-(pyridin-2-yl)-1H-pyrazol-4-yl)pyridines as inhibitors of TGF-ß1 and activin A signalling. Bioorg Med Chem Lett 21:5642-5 (2011)  
Target
Name:
Transforming growth factor beta-1 proprotein
Synonyms:
LAP TGF-beta-1 TGFB1 Transforming growth factor beta-1
Type:
PROTEIN
Mol. Mass.:
44353.76
Organism:
Homo sapiens (Human)
Description:
ChEMBL_768740
Residue:
390
  
Inhibitor
Name:
BDBM50184872
Synonyms:
4-(4-(3-(pyridin-2-yl)-1H-pyrazol-4-yl)pyridin-2-yl)-N-(tetrahydro-2H-pyran-4-yl)benzamide CHEMBL202887 | GW-788388
Type:
Small organic molecule
Emp. Form.:
C25H23N5O2
Mol. Mass.:
425.4824
SMILES:
O=C(NC1CCOCC1)c1ccc(cc1)-c1cc(ccn1)-c1c[nH]nc1-c1ccccn1
: