Target
Histone deacetylase 8
Ligand
BDBM50353232
Substrate
Meas. Tech.
ChEMBL_769064 (CHEMBL1832527)
Ki
136±n/a nM
Citation
 Wang, HYu, NChen, DLee, KCLye, PLChang, JWDeng, WNg, MCLu, TKhoo, MLPoulsen, ASangthongpitag, KWu, XHu, CGoh, KCWang, XFang, LGoh, KLKhng, HHGoh, SKYeo, PLiu, XBonday, ZWood, JMDymock, BWKantharaj, ESun, ET Discovery of (2E)-3-{2-butyl-1-[2-(diethylamino)ethyl]-1H-benzimidazol-5-yl}-N-hydroxyacrylamide (SB939), an orally active histone deacetylase inhibitor with a superior preclinical profile. J Med Chem 54:4694-720 (2011)  
Target
Name:
Histone deacetylase 8
Synonyms:
HD8 HDAC8_HUMAN Histone deacetylase 8 (HDAC-8) | Human HDAC8
Type:
Enzyme
Mol. Mass.:
41749.60
Organism:
Homo sapiens (Human)
Description:
Q9BY41
Residue:
377
  
Inhibitor
Name:
BDBM50353232
Synonyms:
CHEMBL1830424
Type:
Small organic molecule
Emp. Form.:
C20H30N4O2
Mol. Mass.:
358.4778
SMILES:
CCCCCCc1nc2cc(\C=C\C(=O)NO)ccc2n1CCN(C)C
: