Target
Histone deacetylase 2
Ligand
BDBM25150
Substrate
Meas. Tech.
ChEMBL_769058 (CHEMBL1832521)
Ki
22±n/a nM
Citation
 Wang, HYu, NChen, DLee, KCLye, PLChang, JWDeng, WNg, MCLu, TKhoo, MLPoulsen, ASangthongpitag, KWu, XHu, CGoh, KCWang, XFang, LGoh, KLKhng, HHGoh, SKYeo, PLiu, XBonday, ZWood, JMDymock, BWKantharaj, ESun, ET Discovery of (2E)-3-{2-butyl-1-[2-(diethylamino)ethyl]-1H-benzimidazol-5-yl}-N-hydroxyacrylamide (SB939), an orally active histone deacetylase inhibitor with a superior preclinical profile. J Med Chem 54:4694-720 (2011)  
Target
Name:
Histone deacetylase 2
Synonyms:
Cereblon/Histone deacetylase 2 HDAC2 Histone deacetylase 2 (HDAC2) | Human HDAC2
Type:
Chromatin regulator; hydrolase; repressor
Mol. Mass.:
55356.54
Organism:
Homo sapiens (Human)
Description:
Q92769
Residue:
488
  
Inhibitor
Name:
BDBM25150
Synonyms:
(2E)-N-hydroxy-3-[3-(phenylsulfamoyl)phenyl]prop-2-enamide Belinostat PXD101
Type:
Small organic molecule
Emp. Form.:
C15H14N2O4S
Mol. Mass.:
318.348
SMILES:
ONC(=O)\C=C\c1cccc(c1)S(=O)(=O)Nc1ccccc1
: