Target
Cystic fibrosis transmembrane conductance regulator
Ligand
BDBM50353343
Substrate
Meas. Tech.
ChEMBL_769084 (CHEMBL1832641)
IC50
370±n/a nM
Citation
 Snyder, DSTradtrantip, LYao, CKurth, MJVerkman, AS Potent, metabolically stable benzopyrimido-pyrrolo-oxazine-dione (BPO) CFTR inhibitors for polycystic kidney disease. J Med Chem 54:5468-77 (2011)  
Target
Name:
Cystic fibrosis transmembrane conductance regulator
Synonyms:
ABCC7 CFTR Channel conductance-controlling ATPase | cAMP-dependent chloride channel
Type:
Enzyme Catalytic Domain
Mol. Mass.:
168171.30
Organism:
Homo sapiens (Human)
Description:
gi_90421313
Residue:
1480
  
Inhibitor
Name:
BDBM50353343
Synonyms:
CHEMBL1831067
Type:
Small organic molecule
Emp. Form.:
C26H20ClN3O4
Mol. Mass.:
473.908
SMILES:
Cc1cccc(c1)-c1n-2c(C(Oc3ccccc-23)c2ccc(Cl)o2)c2n(C)c(=O)n(C)c(=O)c12
: