Target
Signal transducer and activator of transcription 3
Ligand
BDBM50353444
Substrate
Meas. Tech.
ChEMBL_769099 (CHEMBL1832656)
Ki
6200±n/a nM
Citation
 Page, BDFletcher, SYue, PLi, ZZhang, XSharmeen, SDatti, AWrana, JLTrudel, SSchimmer, ADTurkson, JGunning, PT Identification of a non-phosphorylated, cell permeable, small molecule ligand for the Stat3 SH2 domain. Bioorg Med Chem Lett 21:5605-9 (2011)  
Target
Name:
Signal transducer and activator of transcription 3
Synonyms:
APRF STAT3_HUMAN Signal transducer and activator of transcription 3 (STAT3)
Type:
Protein
Mol. Mass.:
88064.31
Organism:
Homo sapiens (Human)
Description:
P40763
Residue:
770
  
Inhibitor
Name:
BDBM50353444
Synonyms:
CHEMBL1829870 | US10196373, Compound 45C
Type:
Small organic molecule
Emp. Form.:
C35H36N2O6S
Mol. Mass.:
612.735
SMILES:
CN(CC(=O)N(Cc1ccc(cc1)C1CCCCC1)c1ccc(C(O)=O)c(O)c1)S(=O)(=O)c1ccc(cc1)-c1ccccc1
: