Target
Sodium-dependent noradrenaline transporter
Ligand
BDBM50353934
Substrate
Meas. Tech.
ChEMBL_769842 (CHEMBL1831836)
IC50
2304±n/a nM
Citation
 O'Neill, DJAdedoyin, ABray, JADeecher, DCFensome, AGoldberg, JAHarrison, JLeventhal, LMann, CMark, LNogle, LSullivan, NRSpangler, TBTerefenko, EATrybulski, EJUveges, AJVu, AWhiteside, GTZhang, P Discovery of novel selective norepinephrine inhibitors: 1-(2-morpholin-2-ylethyl)-3-aryl-1,3-dihydro-2,1,3-benzothiadiazole 2,2-dioxides (WYE-114152). J Med Chem 54:6824-31 (2011)  
Target
Name:
Sodium-dependent noradrenaline transporter
Synonyms:
Monoamine transporter NET Noradrenaline Transporter (NET) Norepinephrine transporter protein (NET) SLC6A2 Sodium-dependent noradrenaline transporter (NET) | Solute carrier family 6 member 2
Type:
Multi-pass membrane protein
Mol. Mass.:
69337.72
Organism:
Homo sapiens (Human)
Description:
P23975
Residue:
617
  
Inhibitor
Name:
BDBM50353934
Synonyms:
CHEMBL1830883
Type:
Small organic molecule
Emp. Form.:
C18H21N3O3S
Mol. Mass.:
359.443
SMILES:
CN1CCOC(CN2c3ccccc3N(c3ccccc3)S2(=O)=O)C1
: