Target
Sodium-dependent noradrenaline transporter
Ligand
BDBM50353933
Substrate
Meas. Tech.
ChEMBL_769841 (CHEMBL1831835)
IC50
54±n/a nM
Citation
 O'Neill, DJAdedoyin, ABray, JADeecher, DCFensome, AGoldberg, JAHarrison, JLeventhal, LMann, CMark, LNogle, LSullivan, NRSpangler, TBTerefenko, EATrybulski, EJUveges, AJVu, AWhiteside, GTZhang, P Discovery of novel selective norepinephrine inhibitors: 1-(2-morpholin-2-ylethyl)-3-aryl-1,3-dihydro-2,1,3-benzothiadiazole 2,2-dioxides (WYE-114152). J Med Chem 54:6824-31 (2011)  
Target
Name:
Sodium-dependent noradrenaline transporter
Synonyms:
Monoamine transporter NET Noradrenaline Transporter (NET) Norepinephrine transporter protein (NET) SLC6A2 Sodium-dependent noradrenaline transporter (NET) | Solute carrier family 6 member 2
Type:
Multi-pass membrane protein
Mol. Mass.:
69337.72
Organism:
Homo sapiens (Human)
Description:
P23975
Residue:
617
  
Inhibitor
Name:
BDBM50353933
Synonyms:
CHEMBL1830884
Type:
Small organic molecule
Emp. Form.:
C19H23N3O2S
Mol. Mass.:
357.47
SMILES:
O=S1(=O)N(CCC2CCCNC2)c2ccccc2N1c1ccccc1
: