Target
Sodium-dependent noradrenaline transporter
Ligand
BDBM50353936
Substrate
Meas. Tech.
ChEMBL_769841 (CHEMBL1831835)
IC50
89±n/a nM
Citation
 O'Neill, DJAdedoyin, ABray, JADeecher, DCFensome, AGoldberg, JAHarrison, JLeventhal, LMann, CMark, LNogle, LSullivan, NRSpangler, TBTerefenko, EATrybulski, EJUveges, AJVu, AWhiteside, GTZhang, P Discovery of novel selective norepinephrine inhibitors: 1-(2-morpholin-2-ylethyl)-3-aryl-1,3-dihydro-2,1,3-benzothiadiazole 2,2-dioxides (WYE-114152). J Med Chem 54:6824-31 (2011)  
Target
Name:
Sodium-dependent noradrenaline transporter
Synonyms:
Monoamine transporter NET Noradrenaline Transporter (NET) Norepinephrine transporter protein (NET) SLC6A2 Sodium-dependent noradrenaline transporter (NET) | Solute carrier family 6 member 2
Type:
Multi-pass membrane protein
Mol. Mass.:
69337.72
Organism:
Homo sapiens (Human)
Description:
P23975
Residue:
617
  
Inhibitor
Name:
BDBM50353936
Synonyms:
CHEMBL1830886
Type:
Small organic molecule
Emp. Form.:
C19H23N3O4S
Mol. Mass.:
389.469
SMILES:
COc1cccc(c1)N1c2ccccc2N(CC[C@@H]2CNCCO2)S1(=O)=O
: