Target
Sodium-dependent serotonin transporter
Ligand
BDBM50353935
Substrate
Meas. Tech.
ChEMBL_769843 (CHEMBL1831837)
IC50
6410±n/a nM
Citation
 O'Neill, DJAdedoyin, ABray, JADeecher, DCFensome, AGoldberg, JAHarrison, JLeventhal, LMann, CMark, LNogle, LSullivan, NRSpangler, TBTerefenko, EATrybulski, EJUveges, AJVu, AWhiteside, GTZhang, P Discovery of novel selective norepinephrine inhibitors: 1-(2-morpholin-2-ylethyl)-3-aryl-1,3-dihydro-2,1,3-benzothiadiazole 2,2-dioxides (WYE-114152). J Med Chem 54:6824-31 (2011)  
Target
Name:
Sodium-dependent serotonin transporter
Synonyms:
5-HT Transporter 5HTT SC6A4_HUMAN SLC6A4 Serotonin transporter (5HTT) Sodium-dependent serotonin transporter (SERT) | Solute carrier family 6 member 4
Type:
Multi-pass membrane protein
Mol. Mass.:
70322.51
Organism:
Homo sapiens (Human)
Description:
P31645
Residue:
630
  
Inhibitor
Name:
BDBM50353935
Synonyms:
CHEMBL1830885
Type:
Small organic molecule
Emp. Form.:
C18H20FN3O3S
Mol. Mass.:
377.433
SMILES:
Fc1ccccc1N1c2ccccc2N(CC[C@@H]2CNCCO2)S1(=O)=O
: