Target
Neuronal acetylcholine receptor subunit alpha-7
Ligand
BDBM50353945
Substrate
Meas. Tech.
ChEMBL_770049 (CHEMBL1832424)
EC50
10000±n/a nM
Citation
 Akdemir, ARucktooa, PJongejan, AElk, RBertrand, SSixma, TKBertrand, DSmit, ABLeurs, Rde Graaf, Cde Esch, IJ Acetylcholine binding protein (AChBP) as template for hierarchical in silico screening procedures to identify structurally novel ligands for the nicotinic receptors. Bioorg Med Chem 19:6107-19 (2011)  
Target
Name:
Neuronal acetylcholine receptor subunit alpha-7
Synonyms:
ACHA7_HUMAN Cholinergic, Nicotinic Alpha7 Neuronal acetylcholine receptor protein alpha-7 subunit Nicotinic acetylcholine receptor alpha-7 (alpha7 nAChR)
Type:
Mol. Mass.:
56448.33
Organism:
Homo sapiens (Human)
Description:
CHRNA7 (NACHRA7)
Residue:
502
  
Inhibitor
Name:
BDBM50353945
Synonyms:
CHEMBL1831033
Type:
Small organic molecule
Emp. Form.:
C11H14ClNO
Mol. Mass.:
211.688
SMILES:
CC1NCCOC1c1ccc(Cl)cc1
: