Target
Corticotropin-releasing factor receptor 1
Ligand
BDBM50354031
Substrate
Meas. Tech.
ChEMBL_770317 (CHEMBL1833626)
EC50
5.6±n/a nM
Citation
 Saito, TObitsu, TMinamoto, CSugiura, TMatsumura, NUeno, SKishi, AKatsumata, SNakai, HToda, M Pyrazolo[1,5-a]pyrimidines, triazolo[1,5-a]pyrimidines and their tricyclic derivatives as corticotropin-releasing factor 1 (CRF¿?) receptor antagonists. Bioorg Med Chem 19:5955-66 (2011)  
Target
Name:
Corticotropin-releasing factor receptor 1
Synonyms:
CRF-R CRF1 CRFR1 CRH-R 1 CRHR1 Corticotropin-releasing factor receptor 1 (CRF-1) Corticotropin-releasing hormone receptor 1
Type:
Enzyme
Mol. Mass.:
50744.31
Organism:
Homo sapiens (Human)
Description:
P34998
Residue:
444
  
Inhibitor
Name:
BDBM50354031
Synonyms:
CHEMBL1830528
Type:
Small organic molecule
Emp. Form.:
C22H26N4O2
Mol. Mass.:
378.4674
SMILES:
CCC(CC)n1ccc2c(Oc3ccc(CC)cc3OC)nc3ccnn3c12
: