Target
Neprilysin
Ligand
BDBM50354041
Substrate
Meas. Tech.
ChEMBL_770450 (CHEMBL1833759)
IC50
0.36±n/a nM
Citation
 Misawa, KSuzuki, YTakahashi, SYoshimori, ATakasawa, RShibuya, YTanuma, S Structure-based design of dipeptide derivatives for the human neutral endopeptidase. Bioorg Med Chem 19:5935-47 (2011)  
Target
Name:
Neprilysin
Synonyms:
Atriopeptidase CD_antigen=CD10 EPN MME NEP_HUMAN Neutral endopeptidase | Neutral endopeptidase 24.11
Type:
Enzyme
Mol. Mass.:
85505.38
Organism:
Homo sapiens (Human)
Description:
P08473
Residue:
750
  
Inhibitor
Name:
BDBM50354041
Synonyms:
CHEMBL1829584
Type:
Small organic molecule
Emp. Form.:
C28H30N2O5
Mol. Mass.:
474.5482
SMILES:
OC(=O)CCNC(=O)[C@H](Cc1ccc(cc1)-c1ccccc1)N[C@@H](CCc1ccccc1)C(O)=O
: