Target
Myelin-associated glycoprotein
Ligand
BDBM50354050
Substrate
Meas. Tech.
ChEMBL_770762 (CHEMBL1837432)
IC50
1200±n/a nM
Citation
 Zeng, YRademacher, CNycholat, CMFutakawa, SLemme, KErnst, BPaulson, JC High affinity sialoside ligands of myelin associated glycoprotein. Bioorg Med Chem Lett 21:5045-9 (2011)  
Target
Name:
Myelin-associated glycoprotein
Synonyms:
GMA MAG_HUMAN
Type:
PROTEIN
Mol. Mass.:
69048.07
Organism:
Homo sapiens (Human)
Description:
ChEMBL_770764
Residue:
626
  
Inhibitor
Name:
BDBM50354050
Synonyms:
CHEMBL1836310
Type:
Small organic molecule
Emp. Form.:
C29H48N3O21
Mol. Mass.:
774.6995
SMILES:
C[C@@H](O[C@H]1O[C@H](CO)[C@H](O)[C@H](O[C@@H]2O[C@H](CO)[C@H](O)[C@H](O[C@@]3(C[C@H](O)[C@@H](NC(C)=O)[C@@H](O3)[C@H](O)[C@H](O)CO)C([O-])=O)[C@H]2O)[C@H]1NC(C)=O)[C@H](N)C(O)=O
: