Target
Neuraminidase
Ligand
BDBM50354151
Substrate
Meas. Tech.
ChEMBL_770589 (CHEMBL1839500)
IC50
295260±n/a nM
Citation
 Gao, LZu, MWu, SLiu, ALDu, GH 3D QSAR and docking study of flavone derivatives as potent inhibitors of influenza H1N1 virus neuraminidase. Bioorg Med Chem Lett 21:5964-70 (2011)  
Target
Name:
Neuraminidase
Synonyms:
Influenza A Virus Neuraminidase NRAM_I34A1 Neuraminidase A
Type:
Enzyme
Mol. Mass.:
50124.14
Organism:
Influenza A virus (A/Puerto Rico/8/34/Mount Sinai(H1N1))
Description:
P03468
Residue:
454
  
Inhibitor
Name:
BDBM50354151
Synonyms:
CHEMBL1836284
Type:
Small organic molecule
Emp. Form.:
C21H21NO5
Mol. Mass.:
367.3951
SMILES:
OC1CCN(Cc2c(O)cc(O)c3c2oc(cc3=O)-c2ccccc2)CC1
: