Target
Histamine H3 receptor
Ligand
BDBM50354201
Substrate
Meas. Tech.
ChEMBL_770621 (CHEMBL1839631)
Ki
4±n/a nM
Citation
 Zhou, DGross, JLSze, JYAdedoyin, ABBowlby, MDi, LPlatt, BJZhang, GBrandon, NComery, TARobichaud, AJ Pyrrolidin-3-yl-N-methylbenzamides as potent histamine 3 receptor antagonists. Bioorg Med Chem Lett 21:5957-60 (2011)  
Target
Name:
Histamine H3 receptor
Synonyms:
G-protein coupled receptor 97 HH3R HRH3 Histamine H3 receptor (H3) Histamine receptor (H3 and H4)
Type:
G Protein-Coupled Receptor (GPCR)
Mol. Mass.:
48691.47
Organism:
Homo sapiens (Human)
Description:
Binding assays were using CHO cells stably expressing hH3R receptors.
Residue:
445
  
Inhibitor
Name:
BDBM50354201
Synonyms:
CHEMBL1835995
Type:
Small organic molecule
Emp. Form.:
C23H28N4O
Mol. Mass.:
376.4946
SMILES:
CC(C)N1CC[C@H](C1)N(C)C(=O)c1ccc(Cn2cnc3ccccc23)cc1
: