Target
Histamine H3 receptor
Ligand
BDBM50354221
Substrate
Meas. Tech.
ChEMBL_770621 (CHEMBL1839631)
Ki
21±n/a nM
Citation
 Zhou, DGross, JLSze, JYAdedoyin, ABBowlby, MDi, LPlatt, BJZhang, GBrandon, NComery, TARobichaud, AJ Pyrrolidin-3-yl-N-methylbenzamides as potent histamine 3 receptor antagonists. Bioorg Med Chem Lett 21:5957-60 (2011)  
Target
Name:
Histamine H3 receptor
Synonyms:
G-protein coupled receptor 97 HH3R HRH3 Histamine H3 receptor (H3) Histamine receptor (H3 and H4)
Type:
G Protein-Coupled Receptor (GPCR)
Mol. Mass.:
48691.47
Organism:
Homo sapiens (Human)
Description:
Binding assays were using CHO cells stably expressing hH3R receptors.
Residue:
445
  
Inhibitor
Name:
BDBM50354221
Synonyms:
CHEMBL1836038
Type:
Small organic molecule
Emp. Form.:
C24H28N4O
Mol. Mass.:
388.5053
SMILES:
CN([C@H]1CCN(C1)C1CCC1)C(=O)c1ccc(cc1)-n1c(C)nc2ccccc12
: