Target
Trypanothione reductase
Ligand
BDBM50354266
Substrate
Meas. Tech.
ChEMBL_770788 (CHEMBL1837593)
IC50
2000±n/a nM
Citation
 Patterson, SAlphey, MSJones, DCShanks, EJStreet, IPFrearson, JAWyatt, PGGilbert, IHFairlamb, AH Dihydroquinazolines as a novel class of Trypanosoma brucei trypanothione reductase inhibitors: discovery, synthesis, and characterization of their binding mode by protein crystallography. J Med Chem 54:6514-30 (2011)  
Target
Name:
Trypanothione reductase
Synonyms:
N(1),N(8)-bis(glutathionyl)spermidine reductase TR Trypanothione Reductase (TryR)
Type:
Homodimer; oxidoreductase
Mol. Mass.:
53285.53
Organism:
Trypanosoma brucei brucei
Description:
Residue:
492
  
Inhibitor
Name:
BDBM50354266
Synonyms:
CHEMBL1836568
Type:
Small organic molecule
Emp. Form.:
C29H31ClN4O
Mol. Mass.:
487.036
SMILES:
CC1=Nc2ccc(Cl)cc2C(N1CCN1CCN(CC1)C(=O)Cc1ccccc1)c1ccccc1
: