Target
Integrin alpha-2/beta-3
Ligand
BDBM50241180
Substrate
Meas. Tech.
ChEMBL_770670 (CHEMBL1839795)
IC50
13000±n/a nM
Citation
 Krysko, AASamoylenko, GVPolishchuk, PGAndronati, SAKabanova, TAKhristova, TMKuz'min, VEKabanov, VMKrysko, OLVarnek, AAGrygorash, RY RGD mimetics containing phthalimidine fragment as novel ligands of fibrinogen receptor. Bioorg Med Chem Lett 21:5971-4 (2011)  
Target
Name:
Integrin alpha-2/beta-3
Synonyms:
Type:
Mol. Mass.:
Description:
ASSAY_ID of EBI is 770669
Components:
This complex has 2 components.
Component 1
Name:
Integrin beta-3
Synonyms:
CD_antigen=CD61 GPIIIa ITGB3 Platelet membrane glycoprotein IIIa
Type:
Protein
Mol. Mass.:
87038.91
Organism:
Homo sapiens (Human)
Description:
P05106
Residue:
788
  
Component 2
Name:
Integrin alpha-2
Synonyms:
CD49B Collagen receptor ITA2_HUMAN Integrin alpha-2 precursor Platelet membrane glycoprotein Ia | VLA-2 alpha chain
Type:
Single-pass type I membrane protein
Mol. Mass.:
129273.27
Organism:
Homo sapiens (Human)
Description:
Residue:
1181
  
Inhibitor
Name:
BDBM50241180
Synonyms:
(6S,12S,15S)-1,6-diamino-12-(carboxymethyl)-16-hydroxy-1-imino-7,10,13-trioxo-2,8,11,14-tetraazahexadecane-15-carboxylic acid (S)-3-[2-((S)-2-Amino-5-guanidino-pentanoylamino)-acetylamino]-N-((S)-1-carboxy-2-hydroxy-ethyl)-succinamic acid 2-{1-[1-amino-4-amino(imino)methylaminobutylcarboxamidomethylcarboxamido]-2-carboxyethylcarboxamido}-3-hydroxypropanoic acid 3-[2-((S)-2-Amino-5-guanidino-pentanoylamino)-acetylamino]-N-((S)-1-carboxy-2-hydroxy-ethyl)-succinamic acid 3-[2-(2-Amino-5-guanidino-pentanoylamino)-acetylamino]-N-(1-carboxy-2-hydroxy-ethyl)-succinamic acid (RGDS) RGDS
Type:
Small organic molecule
Emp. Form.:
C15H27N7O8
Mol. Mass.:
433.417
SMILES:
[#7]-[#6@@H](-[#6]-[#6]-[#6]\[#7]=[#6](/[#7])-[#7])-[#6](=O)-[#7]-[#6]-[#6](=O)-[#7]-[#6@@H](-[#6]-[#6](-[#8])=O)-[#6](=O)-[#7]-[#6@@H](-[#6]-[#8])-[#6](-[#8])=O
: