Target
LIM domain kinase 1
Ligand
BDBM50354370
Substrate
Meas. Tech.
ChEMBL_770673 (CHEMBL1839798)
IC50
>100000±n/a nM
Citation
 Sleebs, BENikolakopoulos, GStreet, IPFalk, HBaell, JB Identification of 5,6-substituted 4-aminothieno[2,3-d]pyrimidines as LIMK1 inhibitors. Bioorg Med Chem Lett 21:5992-4 (2011)  
Target
Name:
LIM domain kinase 1
Synonyms:
LIMK LIMK1 | LIMK1_HUMAN
Type:
Enzyme Catalytic Domain
Mol. Mass.:
72591.81
Organism:
Homo sapiens (Human)
Description:
gi_4505001
Residue:
647
  
Inhibitor
Name:
BDBM50354370
Synonyms:
CHEMBL1165229
Type:
Small organic molecule
Emp. Form.:
C17H17N3OS
Mol. Mass.:
311.401
SMILES:
COc1ccc(Nc2ncnc3sc4CCCCc4c23)cc1
: