Target
Protein-tyrosine kinase 6
Ligand
BDBM50354434
Substrate
Meas. Tech.
ChEMBL_771345 (CHEMBL1839617)
IC50
10±n/a nM
Citation
 Zeng, HBelanger, DBCurran, PJShipps, GWMiao, HBracken, JBArshad Siddiqui, MMalkowski, MWang, Y Discovery of novel imidazo[1,2-a]pyrazin-8-amines as Brk/PTK6 inhibitors. Bioorg Med Chem Lett 21:5870-5 (2011)  
Target
Name:
Protein-tyrosine kinase 6
Synonyms:
BRK KH domain-containing, RNA-binding, signal transduction-associated protein 1 PTK6_HUMAN Tyrosine Kinase BRK Tyrosine-protein kinase BRK
Type:
Tyrosine-protein kinase
Mol. Mass.:
51839.11
Organism:
Homo sapiens (Human)
Description:
Residue:
451
  
Inhibitor
Name:
BDBM50354434
Synonyms:
CHEMBL1836853
Type:
Small organic molecule
Emp. Form.:
C21H21FN8O
Mol. Mass.:
420.4428
SMILES:
Cc1cn2c(cnc2c(Nc2ccc(cc2F)C(=O)N2CCNCC2)n1)-c1cn[nH]c1
: