Target
5-hydroxytryptamine receptor 7
Ligand
BDBM50354514
Substrate
Meas. Tech.
ChEMBL_771581 (CHEMBL1837760)
Ki
2.8±n/a nM
Citation
 Volk, BGacsályi, IPallagi, KPoszávácz, LGyönös, ISzabó, EBakó, TSpedding, MSimig, GSzénási, G Optimization of (arylpiperazinylbutyl)oxindoles exhibiting selective 5-HT7 receptor antagonist activity. J Med Chem 54:6657-69 (2011)  
Target
Name:
5-hydroxytryptamine receptor 7
Synonyms:
5-HT-7 5-HT7 5-HT7S 5HT7 HTR7 | Serotonin receptor 7
Type:
G Protein-Coupled Receptor (GPCR)
Mol. Mass.:
53573.08
Organism:
Homo sapiens (Human)
Description:
P34969
Residue:
479
  
Inhibitor
Name:
BDBM50354514
Synonyms:
CHEMBL259010
Type:
Small organic molecule
Emp. Form.:
C24H29ClFN3O
Mol. Mass.:
429.958
SMILES:
CCC1(CCCCN2CCN(CC2)c2ccc(Cl)cc2)C(=O)Nc2ccc(F)cc12
: