Target
5-hydroxytryptamine receptor 7
Ligand
BDBM50354518
Substrate
Meas. Tech.
ChEMBL_771581 (CHEMBL1837760)
Ki
72±n/a nM
Citation
 Volk, BGacsályi, IPallagi, KPoszávácz, LGyönös, ISzabó, EBakó, TSpedding, MSimig, GSzénási, G Optimization of (arylpiperazinylbutyl)oxindoles exhibiting selective 5-HT7 receptor antagonist activity. J Med Chem 54:6657-69 (2011)  
Target
Name:
5-hydroxytryptamine receptor 7
Synonyms:
5-HT-7 5-HT7 5-HT7S 5HT7 HTR7 | Serotonin receptor 7
Type:
G Protein-Coupled Receptor (GPCR)
Mol. Mass.:
53573.08
Organism:
Homo sapiens (Human)
Description:
P34969
Residue:
479
  
Inhibitor
Name:
BDBM50354518
Synonyms:
CHEMBL1836858
Type:
Small organic molecule
Emp. Form.:
C24H27Cl3FN3O
Mol. Mass.:
498.848
SMILES:
CCC1(CCCCN2CCN(CC2)c2cccc(Cl)c2)C(=O)Nc2c1cc(Cl)c(F)c2Cl
: