Target
5-hydroxytryptamine receptor 7
Ligand
BDBM50354525
Substrate
Meas. Tech.
ChEMBL_771581 (CHEMBL1837760)
Ki
47±n/a nM
Citation
 Volk, BGacsályi, IPallagi, KPoszávácz, LGyönös, ISzabó, EBakó, TSpedding, MSimig, GSzénási, G Optimization of (arylpiperazinylbutyl)oxindoles exhibiting selective 5-HT7 receptor antagonist activity. J Med Chem 54:6657-69 (2011)  
Target
Name:
5-hydroxytryptamine receptor 7
Synonyms:
5-HT-7 5-HT7 5-HT7S 5HT7 HTR7 | Serotonin receptor 7
Type:
G Protein-Coupled Receptor (GPCR)
Mol. Mass.:
53573.08
Organism:
Homo sapiens (Human)
Description:
P34969
Residue:
479
  
Inhibitor
Name:
BDBM50354525
Synonyms:
CHEMBL411663
Type:
Small organic molecule
Emp. Form.:
C22H26FN3O
Mol. Mass.:
367.4597
SMILES:
Fc1ccc2NC(=O)C(CCCCN3CCN(CC3)c3ccccc3)c2c1
: