Target
5-hydroxytryptamine receptor 1A
Ligand
BDBM50354499
Substrate
Meas. Tech.
ChEMBL_771582 (CHEMBL1837761)
Ki
19±n/a nM
Citation
 Volk, BGacsályi, IPallagi, KPoszávácz, LGyönös, ISzabó, EBakó, TSpedding, MSimig, GSzénási, G Optimization of (arylpiperazinylbutyl)oxindoles exhibiting selective 5-HT7 receptor antagonist activity. J Med Chem 54:6657-69 (2011)  
Target
Name:
5-hydroxytryptamine receptor 1A
Synonyms:
5-HT-1A 5-HT1A 5-hydroxytryptamine receptor 1A (5HT1A) 5ht1a Htr1a Serotonin 1a (5-HT1a) receptor/Adrenergic receptor alpha-1 | Serotonin receptor 1A
Type:
G Protein-Coupled Receptor (GPCR)
Mol. Mass.:
46445.29
Organism:
Rattus norvegicus (rat)
Description:
Binding assays were performed using rat hippocampal membranes.
Residue:
422
  
Inhibitor
Name:
BDBM50354499
Synonyms:
CHEMBL1836791
Type:
Small organic molecule
Emp. Form.:
C24H25F3N2O
Mol. Mass.:
414.4633
SMILES:
FC(F)(F)c1cccc(c1)C1=CCN(CCCCC2C(=O)Nc3ccccc23)CC1
: