Target
5-hydroxytryptamine receptor 1A
Ligand
BDBM50354498
Substrate
Meas. Tech.
ChEMBL_771582 (CHEMBL1837761)
Ki
55±n/a nM
Citation
 Volk, BGacsályi, IPallagi, KPoszávácz, LGyönös, ISzabó, EBakó, TSpedding, MSimig, GSzénási, G Optimization of (arylpiperazinylbutyl)oxindoles exhibiting selective 5-HT7 receptor antagonist activity. J Med Chem 54:6657-69 (2011)  
Target
Name:
5-hydroxytryptamine receptor 1A
Synonyms:
5-HT-1A 5-HT1A 5-hydroxytryptamine receptor 1A (5HT1A) 5ht1a Htr1a Serotonin 1a (5-HT1a) receptor/Adrenergic receptor alpha-1 | Serotonin receptor 1A
Type:
G Protein-Coupled Receptor (GPCR)
Mol. Mass.:
46445.29
Organism:
Rattus norvegicus (rat)
Description:
Binding assays were performed using rat hippocampal membranes.
Residue:
422
  
Inhibitor
Name:
BDBM50354498
Synonyms:
CHEMBL1836792
Type:
Small organic molecule
Emp. Form.:
C24H24F4N2O
Mol. Mass.:
432.4538
SMILES:
Fc1ccc2NC(=O)C(CCCCN3CCC(=CC3)c3cccc(c3)C(F)(F)F)c2c1
: