Target
5-hydroxytryptamine receptor 2B
Ligand
BDBM50354655
Substrate
Meas. Tech.
ChEMBL_771230 (CHEMBL1839312)
Ki
310±n/a nM
Citation
 Moussa, IABanister, SDAkladios, FNChua, SWKassiou, M Effects of linker elongation in a series of N-(2-benzofuranylmethyl)-N'-(methoxyphenylalkyl)piperazines¿? receptor ligands. Bioorg Med Chem Lett 21:5707-10 (2011)  
Target
Name:
5-hydroxytryptamine receptor 2B
Synonyms:
5-HT-2B 5-hydroxytryptamine (serotonin) receptor 2B [Homo sapiens] 5-hydroxytryptamine receptor 2C (5HT2C) HTR2B Serotonin 2b (5-HT2b) receptor | Serotonin Receptor 2B
Type:
G Protein-Coupled Receptor (GPCR)
Mol. Mass.:
54312.47
Organism:
Homo sapiens (Human)
Description:
Receptor binding assays were performed using human clone stably expressed in CHO cells.
Residue:
481
  
Inhibitor
Name:
BDBM50354655
Synonyms:
CHEMBL1834251
Type:
Small organic molecule
Emp. Form.:
C21H24N2O
Mol. Mass.:
320.4281
SMILES:
C(Cc1ccccc1)N1CCN(Cc2cc3ccccc3o2)CC1
: