Target
Glycogen synthase kinase-3 beta
Ligand
BDBM50354748
Substrate
Meas. Tech.
ChEMBL_771509 (CHEMBL1837408)
IC50
1200±n/a nM
Citation
 Cociorva, OMLi, BNomanbhoy, TLi, QNakamura, ANakamura, KNomura, MOkada, KSeto, SYumoto, KLiyanage, MZhang, MCAban, ALeen, BSzardenings, AKRosenblum, JSKozarich, JWKohno, YShreder, KR Synthesis and structure-activity relationship of 4-quinolone-3-carboxylic acid based inhibitors of glycogen synthase kinase-3ß. Bioorg Med Chem Lett 21:5948-51 (2011)  
Target
Name:
Glycogen synthase kinase-3 beta
Synonyms:
GSK-3 beta GSK3B Glycogen synthase kinase 3 beta (GSK3B) Glycogen synthase kinase-3 beta (GSK-3B) Glycogen synthase kinase-3 beta (GSK3B) Glycogen synthase kinase-3beta (GSK3B) | Serine/threonine-protein kinase GSK3B
Type:
Enzyme
Mol. Mass.:
46756.38
Organism:
Homo sapiens (Human)
Description:
P49841
Residue:
420
  
Inhibitor
Name:
BDBM50354748
Synonyms:
CHEMBL1834109
Type:
Small organic molecule
Emp. Form.:
C16H17F2N3O3
Mol. Mass.:
337.3213
SMILES:
CC(C)Nc1c(F)c(N)c2c(c1F)n(cc(C(O)=O)c2=O)C1CC1
: