Target
Glycogen synthase kinase-3 beta
Ligand
BDBM50354749
Substrate
Meas. Tech.
ChEMBL_771509 (CHEMBL1837408)
IC50
600±n/a nM
Citation
 Cociorva, OMLi, BNomanbhoy, TLi, QNakamura, ANakamura, KNomura, MOkada, KSeto, SYumoto, KLiyanage, MZhang, MCAban, ALeen, BSzardenings, AKRosenblum, JSKozarich, JWKohno, YShreder, KR Synthesis and structure-activity relationship of 4-quinolone-3-carboxylic acid based inhibitors of glycogen synthase kinase-3ß. Bioorg Med Chem Lett 21:5948-51 (2011)  
Target
Name:
Glycogen synthase kinase-3 beta
Synonyms:
GSK-3 beta GSK3B Glycogen synthase kinase 3 beta (GSK3B) Glycogen synthase kinase-3 beta (GSK-3B) Glycogen synthase kinase-3 beta (GSK3B) Glycogen synthase kinase-3beta (GSK3B) | Serine/threonine-protein kinase GSK3B
Type:
Enzyme
Mol. Mass.:
46756.38
Organism:
Homo sapiens (Human)
Description:
P49841
Residue:
420
  
Inhibitor
Name:
BDBM50354749
Synonyms:
CHEMBL1834110
Type:
Small organic molecule
Emp. Form.:
C19H21F2N3O3
Mol. Mass.:
377.3851
SMILES:
Nc1c(F)c(NC2CCCCC2)c(F)c2n(cc(C(O)=O)c(=O)c12)C1CC1
: